{"text_format":"1","workbook":"xlsx","n_sheets":5,"sheets":["Instructions","Database","Analysis","Evidence gap map","Definitions"],"not_rendered":{"charts":9,"images":94,"macros":1,"external_links":0,"defined_names":3,"comments":1,"pivot_tables":0},"unopened":[],"bounds":{"document_bytes":16777216,"sheet_cells":100000,"rows_first":2000,"rows_last":500,"rows_between":2000,"halvings":0,"cell_chars":16384,"cell_head_chars":4096},"cells_cut":0,"cells_raw":0,"read":"whole","date_system":"1900"}

{"sheet":"Instructions","index":0,"n_rows":46,"n_cols":1,"rows_kept":46,"cut":false,"hidden":false,"merged":[[41,0,42,0]]}
["Security and Justice Evidence Mapping Database"]
["Instructions"]
[]
["1. Background"]
[]
["The objective of this evidence mapping exercise was to identify and organise the empirical evidence for outputs and outcomes related to S&J interventions. This database is the result of a rigorous review of the evidence base. "]
[]
["2. What this database contains"]
[]
["Database tab: "]
{"$rows_left_out":37}
{"sheet":"Database","index":1,"n_rows":391,"n_cols":103,"rows_kept":391,"cut":false,"hidden":false,"merged":[[0,84,0,102],[0,74,0,83],[0,0,1,1],[0,60,0,73],[0,42,0,59],[0,12,0,14],[0,15,0,19],[0,20,0,24],[0,25,0,26],[0,27,0,41]]}
[{"$f":"Instructions!A1","v":"Security and Justice Evidence Mapping Database"},null,null,null,null,null,null,null,null,null,null,null,"Research design",null,null,"Publication form",null,null,null,null,"Publisher",null,null,null,null,"Geographic scope",null,"Thematic focus",null,null,null,null,null,null,null,null,null,null,null,null,null,null,"Geographical focus",null,null,null,null,null,null,null,null,null,null,null,null,null,null,null,null,null,"Interventions",null,null,null,null,null,null,null,null,null,null,null,null,null,"Outputs",null,null,null,null,null,null,null,null,null,"Outcomes"]
[null,null,null,null,null,null,null,null,null,null,null,"Total count",{"$f":"COUNTA(M6:M393)","v":8},367,15,188,36,24,2,136,278,45,12,47,5,80,306,76,170,20,6,31,31,81,115,121,35,93,36,5,5,18,31,51,24,21,10,71,12,22,26,2,6,54,35,11,9,32,14,null,{"$f":"COUNTA(BI6:BI393)","v":6},134,137,192,229,221,187,104,112,62,71,108,42,21,237,125,162,263,174,112,160,184,62,79,34,125,165,121,71,127,135,136,96,36,{"$f":"COUNTA(CQ6:CQ393)","v":158},{"$f":"COUNTA(CR6:CR393)","v":50},{"$f":"COUNTA(CS6:CS393)","v":50},{"$f":"COUNTA(CT6:CT393)","v":37},12,12,19,28,39]
[null,null,null,null,null,null,null,null,null,null,null,"Count after applying filter",{"$f":"SUBTOTAL(3,M6:M393)","v":8},367,15,188,36,24,2,136,278,45,12,47,5,80,306,76,170,20,6,31,31,81,115,121,35,93,36,5,5,18,31,51,24,21,10,71,12,22,26,2,6,54,35,11,9,32,14,null,{"$f":"SUBTOTAL(3,BI6:BI393)","v":6},134,137,192,229,221,187,104,112,62,71,108,42,21,237,125,162,263,174,112,160,184,62,79,34,125,165,121,71,127,135,136,96,36,{"$f":"SUBTOTAL(3,CQ6:CQ393)","v":158},{"$f":"SUBTOTAL(3,CR6:CR393)","v":50},{"$f":"SUBTOTAL(3,CS6:CS393)","v":50},{"$f":"SUBTOTAL(3,CT6:CT393)","v":37},12,12,19,28,39]
["Number of items catalogued:",{"$f":"COUNTA(B6:B998)","v":386},null,null,null,null,null,null,null,null,null,"Proportion of documents after applying filter",{"$f":"(M3/M2)","v":1},{"$f":"(N3/N2)","v":1},1,1,1,1,1,1,1,1,1,1,1,1,1,1,{"$f":"(AC3/AC2)","v":1},{"$f":"(AD3/AD2)","v":1},1,{"$f":"(AF3/AF2)","v":1},{"$f":"(AG3/AG2)","v":1},1,{"$f":"(AI3/AI2)","v":1},1,1,1,1,1,1,1,1,{"$f":"(AR3/AR2)","v":1},{"$f":"(AS3/AS2)","v":1},{"$f":"(AT3/AT2)","v":1},{"$f":"(AU3/AU2)","v":1},{"$f":"(AV3/AV2)","v":1},{"$f":"(AW3/AW2)","v":1},{"$f":"(AX3/AX2)","v":1},{"$f":"(AY3/AY2)","v":1},{"$f":"(AZ3/AZ2)","v":1},{"$f":"(BA3/BA2)","v":1},1,{"$f":"(BC3/BC2)","v":1},{"$f":"(BD3/BD2)","v":1},{"$f":"(BE3/BE2)","v":1},{"$f":"(BF3/BF2)","v":1},{"$f":"(BG3/BG2)","v":1},null,{"$f":"(BI3/BI2)","v":1},{"$f":"(BJ3/BJ2)","v":1},{"$f":"(BK3/BK2)","v":1},{"$f":"(BL3/BL2)","v":1},1,{"$f":"(BN3/BN2)","v":1},{"$f":"(BO3/BO2)","v":1},{"$f":"(BP3/BP2)","v":1},{"$f":"(BQ3/BQ2)","v":1},{"$f":"(BR3/BR2)","v":1},{"$f":"(BS3/BS2)","v":1},1,1,1,{"$f":"(BW3/BW2)","v":1},{"$f":"(BX3/BX2)","v":1},{"$f":"(BY3/BY2)","v":1},{"$f":"(BZ3/BZ2)","v":1},1,{"$f":"(CB3/CB2)","v":1},{"$f":"(CC3/CC2)","v":1},{"$f":"(CD3/CD2)","v":1},{"$f":"(CE3/CE2)","v":1},1,{"$f":"(CG3/CG2)","v":1},{"$f":"(CH3/CH2)","v":1},{"$f":"(CI3/CI2)","v":1},{"$f":"(CJ3/CJ2)","v":1},{"$f":"(CK3/CK2)","v":1},1,{"$f":"(CM3/CM2)","v":1},{"$f":"(CN3/CN2)","v":1},{"$f":"(CO3/CO2)","v":1},1,{"$f":"(CQ3/CQ2)","v":1},{"$f":"(CR3/CR2)","v":1},{"$f":"(CS3/CS2)","v":1},{"$f":"(CT3/CT2)","v":1},{"$f":"(CU3/CU2)","v":1},1,1,1,1]
["Author/s","Year","Title","Book Editors","Journal/Book Name/Series Name","Location published","Publisher/Institution","Vol","Issue","Pages","Abstract/Summary","URL/DOI","Experimental","Observational","Secondary","Peer-reviewed journal","Book or book chapter","Evaluation","Workshop or conference report","Other report","Academic organisation/think-tank","Multi-lateral, bi-lateral or inter-governmental org","National/host government organisation","Non-governmental organisation","Private/commercial organisation","Multi-country","Single country","Defence","Police","Intelligence","Border security","Security and justice governance","Multi-sectoral focus","Non-state actors","Justice sector reform","Access to Justice/Legal empowerment","Prisons","Legal reform","Security promotion/Violence reduction","Urbanisation","Counter-terrorism","Organised crime","Global","Eastern Africa","Middle Africa","Southern Africa","Northern Africa","Western Africa","Caribbean","Central America","South America","Central Asia","East Asia","South Asia","South-East Asia","West Asia","East Europe","South Europe","Oceania","Countries","Non-intervention","Accountability interventions","Non-state actor interventions","Community-based","Capacity building","Strategic/statutory frameworks","Restructuring the security and justice sector ","Gender specific interventions","Infrastructure and equipment","Political engagement/Political will","DDR","Legal services","Non-state/Justice facilitator capacity building","Preventative interventions","Accountability","Non-state actor inclusion","Community participation","Capacity","Confidence/trust/satisfaction","Gender sensitivity/balancing","Roles/coordination/dialogue","Strategic frameworks","Application/compliance/interpretation","State/non-state linkages","Incentives","Responsiveness","Political will","Ownership","Citizens feel safe and secure","Access to provision","Stability/conflict/violence","Resources/sustainability","Security and justice  actors protect","Judicial redress","Human rights","Actual crime rates","Legal awareness/confidence","Gender-based violence rates","Economic development","Poverty reduction","Access to land, inheritance and property rights","Access to public services and economic resources","Women's empowerment and gender equality"]
["Abatneh, Abraham Sewonet and Lubang, Simon Monoja",2011,"Police reform and state formation in Southern Sudan",null,"Canadian Journal of Development Studies",null,null,32,1,"94-108","Since the signing of the Comprehensive Peace Agreement between the Sudanese government and the Sudan People's Liberation Army/Movement in 2005, stability has prevailed but peace remains fragile in Southern Sudan. This article explores the modernisation of security forces in the territory, focusing on challenges and opportunities for the Southern Sudan Police Service. It examines how the political ambivalence of national leaders and key international actors, linked to their goal of creating a state in the South, are shaping the new police force. The study also examines the impact that institutional factors such as a weak legal framework and structural factors such as scarce public resources are having on the development of an effective, rights-respecting police service in the South.","http://dx.doi.org/10.1080/02255189.2011.576143",null,"x","x","x",null,null,null,null,"x",null,null,null,null,null,"x",null,"x",null,null,null,null,"x",null,null,null,null,null,null,null,null,null,"x",null,null,null,null,null,null,null,null,null,null,null,null,null,null,null,"South Sudan",null,null,null,"x","x","x","x",null,"x",null,"x",null,null,null,"x","x",null,"x","x",null,"x","x",null,"x","x","x","x",null,null,null,null,"x","x",null,"x"]
["Abatoni, Jane Gatete, et al.",2009,"Case Studies of Gender-Sensitive Police Reform in Rwanda and Timor-Leste",null,null,"New York","United Nations Development Fund for Women (UNIFEM)",null,null,null,"The United Nations Development Fund for Women (UNIFEM) is working to support women’s engagement in peacebuilding and preventing sexual violence through a programme launched in 2007 titled ‘Supporting Women’s Engagement in Peace-Building and Preventing Sexual Violence in Conflict: Community-Led Approaches.’ Funded by the United Kingdom’s Department for International Development (DFID). This report analyzes the programme’s initiatives to support gender-sensitive police reform in Rwanda and Timor-Leste.","http://www.unwomen.org/~/media/Headquarters/Media/Publications/UNIFEM/0602_CaseStudiesOfGenderSensitivePoliceReform_en.pdf",null,"x",null,null,null,null,null,"x",null,"x",null,null,null,"x",null,null,"x",null,null,null,null,null,null,"x",null,"x",null,null,null,null,null,"x",null,null,null,null,null,null,null,null,null,null,"x",null,null,null,null,"Rwanda; Timor-Leste",null,"x",null,"x","x","x",null,"x",null,null,null,null,null,null,"x",null,"x","x",null,"x","x","x",null,null,null,"x",null,null,null,"x",null,null,null,null,"x",null,null,"x"]
["Adamu, Fatima L. and Para-Mallam, Oluwafunmilayo J.",2012,"The role of religion in women's campaigns for legal reform in Nigeria",null,"Development in Practice",null,"Taylor & Francis, Ltd. on behalf of Oxfam GB",22,42160,"803-818","Legal reform is necessary but not sufficient to realise women's rights. This paper compares two campaigns for legal reform in Nigeria: attempts to domesticate the UN Convention for the Elimination of all forms of Discrimination Against Women (CEDAW) infederal law, which resulted in defeat of the bill in 2007, and a successful campaign to introduce legislation to prevent the mistreatment of widows in Anambra State. It considers the role of religion in the campaigns, by examining how the women's movement engaged with religious actors. The research shows that religious beliefs, discourses, and actors had a significant influence on the outcomes of the campaigns, in part because of the content of the proposed legislation, but also because of the strategies adopted by the campaigners and the interests of the religious bodies concerned. Despite the implication of religion in gender inequality, these cases show that religious teachings, leaders, and organisations can be allies rather than obstacles in achieving progressive social change.","http://dx.doi.org/10.1080/09614524.2012.685875",null,"x",null,"x",null,null,null,null,null,null,"x",null,null,null,"x",null,null,null,null,null,null,"x",null,"x",null,"x",null,null,null,null,null,null,null,null,null,"x",null,null,null,null,null,null,null,null,null,null,null,"Nigeria",null,null,"x",null,null,"x",null,"x",null,null,null,"x",null,null,null,"x","x",null,null,"x",null,"x",null,null,null,null,null,null,null,null,null,null,null,null,null,null,"x"]
["Africa, Sandy",2008,"South Africa: SSR after Apartheid","Donais, Timothy","Local Ownership and Security Sector Reform","Geneva","Geneva Centre for the Democratic Control of Armed Forces",null,null,"169-189","This chapter evaluates the experience of local ownership of security sector reform in the South African context. It contrasts the conditions that preceded the transfer of political power with the challenges of the post-1994 period.","http://www.dcaf.ch/content/download/35614/526445/file/LocalOwnershipandSSR1.pdf",null,"x",null,null,"x",null,null,null,null,null,null,"x",null,null,"x","x","x","x",null,null,null,null,null,null,null,null,null,null,null,null,null,null,null,"x",null,null,null,null,null,null,null,null,null,null,null,null,null,"South Africa",null,"x","x","x","x","x","x",null,null,null,"x",null,null,null,"x","x","x","x","x",null,null,"x",null,null,"x","x","x","x","x",null,null,"x",null,null,"x"]
["Africa, Sandy",2009,"The South African Intelligence Services: A Historical Perspective","Africa, Sandy and Kwadjo, Johnny","Changing Intelligence Dynamics in Africa","Birmingham","Global Facilitation Network for Security Sector Reform/University of Birmingham",null,null,"61-94",null,"http://www.africansecuritynetwork.org/site/index.php?option=com_phocadownload&view=category&download=5:changing-intelligence-dynamics-in-africa&id=2:books&Itemid=186",null,"x",null,null,"x",null,null,null,"x",null,null,null,null,null,"x",null,null,"x",null,null,null,null,null,null,null,null,null,null,null,null,null,null,null,"x",null,null,null,null,null,null,null,null,null,null,null,null,null,"South Africa",null,"x","x",null,"x","x","x",null,null,null,null,null,null,null,"x",null,null,"x","x",null,"x","x",null,null,null,null,null,null,null,"x",null,"x"]
{"$rows_left_out":382}
{"sheet":"Analysis","index":2,"n_rows":116,"n_cols":3,"rows_kept":116,"cut":false,"hidden":false,"merged":[[7,2,8,2],[7,0,8,0]]}
[{"$f":"Instructions!A1","v":"Security and Justice Evidence Mapping Database"}]
["Analysis"]
[]
["Tick the box next to each criterion to select items related to that criterion.  When multiple boxes are ticked, only items that satisfy all criteria are selected."]
["When you first open this spreadsheet, you might need to click the 'reset all filters' button before beginning to make any selections."]
["Switch back to the 'Database' page to see the publications that have been selected."]
[]
["Number of documents included by the current combination of filters:",null,{"$f":"SUBTOTAL(3,Database!A6:A996)","v":386}]
[]
[]
{"$rows_left_out":107}
{"sheet":"Evidence gap map","index":3,"n_rows":58,"n_cols":11,"rows_kept":58,"cut":false,"hidden":false,"merged":[[42,1,42,9],[24,1,24,9],[6,1,6,9]]}
[{"$f":"Instructions!A1","v":"Security and Justice Evidence Mapping Database"}]
["Evidence gap map"]
[]
["This table shows the number of studies included in this review that addressed each combination of interventions and outputs or outcomes. "]
["Green cells show where the review found a significant number of studies - darker shades of green indicate more studies found.  Red cells highlight evidence gaps - darker shades of red indicate greater evidence gaps."]
[]
[null,"Outputs"]
["Interventions",{"$f":"Database!BW5","v":"Accountability"},{"$f":"Database!BX5","v":"Non-state actor inclusion"},{"$f":"Database!BY5","v":"Community participation"},{"$f":"Database!BZ5","v":"Capacity"},{"$f":"Database!CA5","v":"Confidence/trust/satisfaction"},{"$f":"Database!CB5","v":"Gender sensitivity/balancing"},{"$f":"Database!CC5","v":"Roles/coordination/dialogue"},{"$f":"Database!CD5","v":"Strategic frameworks"},{"$f":"Database!CE5","v":"Application/compliance/interpretation"},{"$f":"Database!CF5","v":"State/non-state linkages"}]
[{"$f":"Database!BI5","v":"Non-intervention"},{"$f":"COUNTIFS(Database!$BI$6:$BI$996,\">''\",Database!BW$6:BW$996,\">''\")","v":2},{"$f":"COUNTIFS(Database!$BI$6:$BI$996,\">''\",Database!BX$6:BX$996,\">''\")","v":0},{"$f":"COUNTIFS(Database!$BI$6:$BI$996,\">''\",Database!BY$6:BY$996,\">''\")","v":1},{"$f":"COUNTIFS(Database!$BI$6:$BI$996,\">''\",Database!BZ$6:BZ$996,\">''\")","v":1},{"$f":"COUNTIFS(Database!$BI$6:$BI$996,\">''\",Database!CA$6:CA$996,\">''\")","v":0},{"$f":"COUNTIFS(Database!$BI$6:$BI$996,\">''\",Database!CB$6:CB$996,\">''\")","v":1},{"$f":"COUNTIFS(Database!$BI$6:$BI$996,\">''\",Database!CC$6:CC$996,\">''\")","v":0},{"$f":"COUNTIFS(Database!$BI$6:$BI$996,\">''\",Database!CD$6:CD$996,\">''\")","v":0},{"$f":"COUNTIFS(Database!$BI$6:$BI$996,\">''\",Database!CE$6:CE$996,\">''\")","v":0},{"$f":"COUNTIFS(Database!$BI$6:$BI$996,\">''\",Database!CF$6:CF$996,\">''\")","v":0}]
[{"$f":"Database!BJ5","v":"Accountability interventions"},{"$f":"COUNTIFS(Database!$BJ$6:$BJ$996,\">''\",Database!BW$6:BW$996,\">''\")","v":107},{"$f":"COUNTIFS(Database!$BJ$6:$BJ$996,\">''\",Database!BX$6:BX$996,\">''\")","v":49},{"$f":"COUNTIFS(Database!$BJ$6:$BJ$996,\">''\",Database!BY$6:BY$996,\">''\")","v":57},{"$f":"COUNTIFS(Database!$BJ$6:$BJ$996,\">''\",Database!BZ$6:BZ$996,\">''\")","v":100},{"$f":"COUNTIFS(Database!$BJ$6:$BJ$996,\">''\",Database!CA$6:CA$996,\">''\")","v":67},{"$f":"COUNTIFS(Database!$BJ$6:$BJ$996,\">''\",Database!CB$6:CB$996,\">''\")","v":36},{"$f":"COUNTIFS(Database!$BJ$6:$BJ$996,\">''\",Database!CC$6:CC$996,\">''\")","v":67},{"$f":"COUNTIFS(Database!$BJ$6:$BJ$996,\">''\",Database!CD$6:CD$996,\">''\")","v":82},{"$f":"COUNTIFS(Database!$BJ$6:$BJ$996,\">''\",Database!CE$6:CE$996,\">''\")","v":20},{"$f":"COUNTIFS(Database!$BJ$6:$BJ$996,\">''\",Database!CF$6:CF$996,\">''\")","v":12}]
{"$rows_left_out":49}
{"sheet":"Definitions","index":4,"n_rows":62,"n_cols":2,"rows_kept":62,"cut":false,"hidden":false,"merged":[[43,0,44,0],[43,1,44,1],[12,0,13,0],[12,1,13,1],[22,0,22,1],[41,0,42,0],[41,1,42,1],[24,0,25,0],[24,1,25,1],[26,0,27,0],[26,1,27,1],[29,0,30,0],[29,1,30,1],[31,0,32,0],[31,1,32,1],[39,0,39,1]]}
[{"$f":"Instructions!A1","v":"Security and Justice Evidence Mapping Database"}]
["Definitions"]
[]
["1. Intervention categories"]
[]
["Non-intervention","Evidence that identifies outputs or outcomes of interest, but where it is not clear that there was any aid intervention, or what it entailed."]
["Developing accountability mechanisms (at national and local/community level)","Interventions directed at enhancing and developing accountability mechanisms and democratic oversight, to ensure that security and justice agencies meet expected standards of behaviour and performance, including the prevention of abuses and violations by personnel. At the local community-level, this includes interventions to develop the capacity of civil society organisations to actively monitor security and justice policies and practices. This may also include legal empowerment initiatives, which aim to make the law more responsive to the needs of the poor and the vulnerable, and to assist them in protecting their rights and demanding accountable governance. At the national level, this includes interventions to develop and strengthen oversight mechanisms at the executive level. It also includes supporting independent oversight institutions, including the legislature (parliament), the judiciary, and other independent bodies with specialised mandates in the governance and accountability of the security and justice sectors. "]
["Non-state security and justice influencing reform and national level processes","Interventions directed at legal or statutory non-state actors to support their engagement in the reform process at a national level. This includes supporting the engagement of diverse groups in dialogue on security and justice, supporting confidence building between the security and justice sectors and civil society, or supporting civil-society to undertake outreach and awareness raising programmes. \n\nThis includes interventions initiated by non-state actors, such as non-governmental organisations, to influence national-level processes.\n\nThis category also includes interventions directed at extra-legal or non-statutory non-state actors who may influence security and justice processes at a national level in different ways through DDR, integration, transitional justice and peace processes.\n"]
["Community-based approaches","Interventions directed at local-level developments and actors. This includes interventions to support the engagement of marginalised and vulnerable groups, and to promote formal interaction between communities, customary justice mechanisms, local officials and authority, and security and justice agency representatives. This also includes legal empowerment initiatives, which aim to use the law to benefit the disadvantaged, in terms of assisting people to protect their rights, pursuing their economic interests and demanding accountable and responsive governance. This also includes attempts to communicate information about the functioning of security and justice institutions and respective reforms to the wider public. "]
["Organisational capacity building interventions","Interventions to improve the institutional and organisational capacity of state security and justice institutions and agencies. This will typically be technical assistance comprised of training and organisational development interventions focussed on agencies and the appropriate ministries governing them. Capacity building interventions include those focussing on increasing capabilities, professionalisation and leadership, as well as in areas such as improving human rights compliance, access to redress and gender equality. This includes the development of professional legal education and qualifications."]
{"$rows_left_out":52}